{"text_format":"1","workbook":"xlsx","n_sheets":2,"sheets":["Feuil1","Feuil2"],"not_rendered":{"charts":0,"images":1,"macros":1,"external_links":0,"defined_names":3,"comments":0,"pivot_tables":0},"unopened":[],"bounds":{"document_bytes":16777216,"sheet_cells":100000,"rows_first":2000,"rows_last":500,"rows_between":2000,"halvings":0,"cell_chars":16384,"cell_head_chars":4096},"cells_cut":0,"cells_raw":0,"read":"whole","date_system":"1900"}

{"sheet":"Feuil1","index":0,"n_rows":73,"n_cols":57,"rows_kept":73,"cut":false,"hidden":false,"merged":[[33,32,34,54],[68,1,72,27],[72,30,72,52],[49,33,49,51],[58,8,58,27],[51,39,51,52],[52,39,52,52],[55,1,56,27],[60,3,63,27],[54,30,54,52],[56,30,56,52],[33,6,33,29],[35,6,35,29],[43,30,43,39],[43,40,43,52],[48,36,48,40],[46,35,46,52],[47,30,47,52],[37,7,37,11],[42,1,43,27],[40,29,40,53],[44,34,44,52],[45,34,45,52],[44,1,46,27],[7,37,7,52],[1,36,1,53],[8,41,8,54],[15,8,15,47],[7,18,10,35],[31,1,31,10],[37,20,37,47],[31,11,31,21],[0,1,10,14],[19,1,19,29],[28,1,29,4],[25,1,26,4],[11,1,14,53],[2,37,2,52],[3,37,3,52],[4,37,4,52],[6,37,6,52],[25,5,26,30],[27,5,27,30],[28,5,29,30],[1,18,6,35]]}
[]
[null,null,null,null,null,null,null,null,null,null,null,null,null,null,null,null,null,null,null,null,null,null,null,null,null,null,null,null,null,null,null,null,null,null,null,null,"Association Sportive Noiseraie Champy"]
[null,null,null,null,null,null,null,null,null,null,null,null,null,null,null,null,null,null,null,null,null,null,null,null,null,null,null,null,null,null,null,null,null,null,null,null,null,"Gymnase de la Butte Verte "]
[null,null,null,null,null,null,null,null,null,null,null,null,null,null,null,null,null,null,null,null,null,null,null,null,null,null,null,null,null,null,null,null,null,null,null,null,null,"5 Boulevard du Champy-Richardets"]
[null,null,null,null,null,null,null,null,null,null,null,null,null,null,null,null,null,null,null,null,null,null,null,null,null,null,null,null,null,null,null,null,null,null,null,null,null,"93160 Noisy Le Grand"]
[]
[null,null,null,null,null,null,null,null,null,null,null,null,null,null,null,null,null,null,null,null,null,null,null,null,null,null,null,null,null,null,null,null,null,null,null,null,null,"Contact : Raphael VESSIER"]
[null,null,null,null,null,null,null,null,null,null,null,null,null,null,null,null,null,null,null,null,null,null,null,null,null,null,null,null,null,null,null,null,null,null,null,null,null,"Tel. : 06 87 95 09 42"]
[null,null,null,null,null,null,null,null,null,null,null,null,null,null,null,null,null,null,null,null,null,null,null,null,null,null,null,null,null,null,null,null,null,null,null,null,"Courriel : ",null,null,null,null,"inscription@grimpeanoisy.fr"]
[]
[]
[null,"Bulletin d'Adhésion \"Enfant\""]
[]
[]
[]
[null,null,null,null,null,null,null,null,"Enfants nés entre 2007 et 2010"]
[]
[null,null,null,null,null,null,null,null,null,"Les cases",null,null,null,null,null,"  ci-dessous indiquent une option. Elles sont à cocher selon l'option choisie."]
[]
[]
[]
[null,null,null,null,null,null,null,null,null,null,null,null,null,null,null,null,null,null,null,null,null,null,null,null,null,null,null,null,null,null,null,null,null,null,null,null,null,null,null,null,null,null,null,null,null,null,null,null,null,null,null,null,null,null,null,null,0]
[null,null,null,null,null,null,null,null,null,null,null,null,null,null,null,null,null,null,null,null,null,null,null,null,null,null,null,null,null,null,null,null,null,"Tarif des adhésions :"]
[null,"Partie relative à l'enfant",null,null,null,null,null,null,null,null,null,null,null,"(A remplir en majuscules :)",null,null,null,null,null,null,null,null,null,null,null,null,null,null,null,null,null,null,null,"1 enfant + 1 adulte accompagnant : 110€"]
[]
[null,"NOM :",null,null,null,null,null,null,null,null,null,null,null,null,null,null,null,null,null,null,null,null,null,null,null,null,null,null,null,null,null,null,null,"Ou"]
[null,null,null,null,null,null,null,null,null,null,null,null,null,null,null,null,null,null,null,null,null,null,null,null,null,null,null,null,null,null,null,null,null,"1 enfant + 1 adulte grimpeur : 165€"]
[]
[null,"Pénom :",null,null,null,null,null,null,null,null,null,null,null,null,null,null,null,null,null,null,null,null,null,null,null,null,null,null,null,null,null,null,null,null,"Pour un 2ème enfant : + 75€"]
[null,null,null,null,null,null,null,null,null,null,null,null,null,null,null,null,null,null,null,null,null,null,null,null,null,null,null,null,null,null,null,null,null,null,"Pour un 2ème accompagnant : +35€"]
[]
[null,"Date de naissance : ",null,null,null,null,null,null,null,null,null,null,null,null,null,null,null,null,null,null,null,null,null,null,null,null,null,null,null,null,null,null,null,null,null,null,null,null,null,null,null,null,null,null,null,null,null,null,null,null,null,null,null,null,null,null,0]
[]
[null,"Adresse :",null,null,null,null,null,null,null,null,null,null,null,null,null,null,null,null,null,null,null,null,null,null,null,null,null,null,null,null,null,null,"Pour faciliter le traitement des bulletins, merci de bien vouloir nous faire parvenir en un seul envoi"]
[]
[null,null,null,null,null,null,null,null,null,null,null,null,null,null,null,null,null,null,null,null,null,null,null,null,null,null,null,null,null,null,null,null,"(*) Chèque à libeller à l'ordre de AS Noiseraie Champy"]
[]
[null,"Code postal :",null,null,null,null,null,null,null,null,null,null,null,null,null,null,null,"Ville : "]
[]
[null,"En signant ce bulletin d'adhésion, "]
[null,"1°) je reconnais :",null,null,null,null,null,null,null,null,null,null,null,null,null,null,null,null,null,null,null,null,null,null,null,null,null,null,null,"Autorisation parentale :"]
[null,"- être informé qu'aucun remboursement ne sera effectué ;"]
[null,"- avoir reçu une notice d'assurance et en avoir pris connaissance avant d'adhérer ;"]
[null,null,null,null,null,null,null,null,null,null,null,null,null,null,null,null,null,null,null,null,null,null,null,null,null,null,null,null,null,null,"Tuteur légal à préciser :"]
[null,"- avoir reçu une notice relative à la fourniture, selon le cas, d'un certificat médical de moins d'un an ou d'une attestation et après avoir répondu au questionnaire santé, fournir en conséquence :",null,null,null,null,null,null,null,null,null,null,null,null,null,null,null,null,null,null,null,null,null,null,null,null,null,null,null,null,"NOM : "]
[null,null,null,null,null,null,null,null,null,null,null,null,null,null,null,null,null,null,null,null,null,null,null,null,null,null,null,null,null,null,"Prénom :"]
[null,null,null,null,null,null,null,null,null,null,null,null,null,null,null,null,null,null,null,null,null,null,null,null,null,null,null,null,null,null,"Adresse :"]
[]
[null,null,null,null,null,null,null,null,null,null,null,null,null,null,null,null,null,null,null,null,null,null,null,null,null,null,null,null,null,null,"Code postal :"]
[null,"2°) j’autorise l’ASNC à prendre, détenir et diffuser mon image ",null,null,null,null,null,null,null,null,null,null,null,null,null,null,null,null,null,null,null,null,null,null,null,null,null,null,null,null,"Ville : "]
[null,"(ou l’image de mon enfant si l’adhérent est mineur) sous "]
[null,"quelque forme de support que ce soit. Les images sont ",null,null,null,null,null,null,null,null,null,null,null,null,null,null,null,null,null,null,null,null,null,null,null,null,null,null,null,null,"Téléphone domicile :"]
[null,"acquises définitivement au profit de l’ASNC quelle que soit la ",null,null,null,null,null,null,null,null,null,null,null,null,null,null,null,null,null,null,null,null,null,null,null,null,null,null,null,null,"Téléphone portable :",null,null,null,null,null,null,null,null,null,null,null,null,null,null,null,null,null,null,null,null,null,null,null,null,null,0]
[null,"période de leur utilisation et sans aucun paiement.",null,null,null,null,null,null,null,null,null,null,null,null,null,null,null,null,null,null,null,null,null,null,null,null,null,null,null,null,"Adresse e-Mail :"]
[null,"3°) je m'engage à ce que mon enfant : "]
[null,"- respecte le règlement intérieur de l'association et ceux des installations sportives utilisées",null,null,null,null,null,null,null,null,null,null,null,null,null,null,null,null,null,null,null,null,null,null,null,null,null,null,null,null,"J'autorise mon enfant :",null,null,null,null,null,null,null,null,null,"(Indiquer  son prénom)"]
[null,null,null,null,null,null,null,null,null,null,null,null,null,null,null,null,null,null,null,null,null,null,null,null,null,null,null,null,null,null,{"$f":"IF(F29=\"\",\"\",F29)","v":""}]
[null,"4°) je souhaite recevoir la Newsletter de l'association à l'adresse ",null,null,null,null,null,null,null,null,null,null,null,null,null,null,null,null,null,null,null,null,null,null,null,null,null,null,null,null,"- à adhérer à l'AS Noiseraie Champy, "]
[null,"e-Mail suivante :",null,null,null,null,null,null,null,null,null,null,null,null,null,null,null,null,null,null,null,null,null,null,null,null,null,null,null,null,"- à être transporté en voiture particulière ou en car, dans"]
[null,"5°) Je joins à ce bulletin (**) :",null,null,null,null,null,null,null,null,null,null,null,null,null,null,null,null,null,null,null,null,null,null,null,null,null,null,null,null,null,"le cadre des déplacements organisés par le club."]
[null,null,null,"- Le présent bulletin d'adhésion dûment complété puis imprimé, daté et signé (une pré-inscription est vivement conseillée en renvoyant par mail ce bulletin en format Excel à inscription@grimpeanoisy.fr)"]
[null,null,null,null,null,null,null,null,null,null,null,null,null,null,null,null,null,null,null,null,null,null,null,null,null,null,null,null,null,null,"J'autorise les responsables du club ou responsable de "]
[null,null,null,null,null,null,null,null,null,null,null,null,null,null,null,null,null,null,null,null,null,null,null,null,null,null,null,null,null,null,"la sortie à faire dispenser les soins nécessaires et utiles "]
[null,null,null,null,null,null,null,null,null,null,null,null,null,null,null,null,null,null,null,null,null,null,null,null,null,null,null,null,null,null,"en cas d'urgence sur mon enfant."]
[null,null,null,"- deux photos d'identité au format 35 mm X 45 mm",null,null,null,null,null,null,null,null,null,null,null,null,null,null,null,null,null,null,null,null,null,null,null,null,null,null,"Date et Signature du représentant légal :"]
[null,null,null,"- deux enveloppes timbrées à mon adresse domiciliaire"]
[null,null,null,"- le chèque de cotisation."]
[null,null,null,"- le certifcat médical ou l'attestation"]
[null,"Date et Signature d'un des parents de l'enfant ou  du représentant légal :"]
[]
[]
[]
[null,null,null,null,null,null,null,null,null,null,null,null,null,null,null,null,null,null,null,null,null,null,null,null,null,null,null,null,null,null,"(**)  Seul les dossiers complets seront pris en compte"]

{"sheet":"Feuil2","index":1,"n_rows":2,"n_cols":25,"rows_kept":2,"cut":false,"hidden":true,"merged":[]}
["Nom","Prénom","Date de naissance","Sexe","Adresse","Adresse","Complément 2","Code postal","Ville","Assurance","Tel Dom","Tel Pro","Tel adhérent portable","Mail NewsLetter","No Licence","Type licence","Type adhérent","Cours","Attestation/Certificat","Représentant - Urgence Nom Prénom","Représentant Portable","Représentant Urgence Tel Dom","Représentant Mail","Accepte NewsLetters","Facture demandée"]
[{"$f":"Feuil1!F26","v":0},{"$f":"Feuil1!F29","v":0},{"$f":"TEXT(Feuil1!L32,\"jj/mm/aaaa\")","v":"00/01/1900"},{"$f":"IFERROR(CHOOSE(Feuil1!BE32,\"M\",\"F\"),\"\")","v":""},{"$f":"TRIM(Feuil1!G34)","v":""},{"$f":"TRIM(Feuil1!G36)","v":""},null,{"$f":"Feuil1!H38","v":0},{"$f":"Feuil1!U38","v":0},"Oui",{"$f":"Feuil1!AC52","v":0},null,{"$f":"Feuil1!W55","v":0},{"$f":"IF(Feuil1!$I$59=\"\",\"\",Feuil1!$I$59)","v":""},null,"OMNI","enfant",{"$f":"IFERROR(CHOOSE(Feuil1!BE22,\"Sam 14h-15h\",\"Sam 15h-16h\"),\"\")","v":""},{"$f":"IFERROR(CHOOSE(Feuil1!BE53,\"Certificat\", \"Attestation\"),\"\")","v":""},{"$f":"Feuil1!AI45 & \" \" & Feuil1!AI46","v":" "},{"$f":"Feuil1!AN53","v":0},{"$f":"Feuil1!AN52","v":0},{"$f":"Feuil1!AE55","v":0},{"$f":"IF(Feuil1!I59<>\"\",\"Oui\",\"Non\")","v":"Non"},false]